Reaction Details
TargetProtein-arginine deiminase type-4
LigandBDBM80075
Substrate/Competitorn/a
Meas. Tech.ChEMBL_1290377 (CHEMBL3119092)
IC50 3300±n/a nM
Citation Dreyton, CJAnderson, EDSubramanian, VBoger, DLThompson, PR Insights into the mechanism of streptonigrin-induced protein arginine deiminase inactivation. Bioorg Med Chem22:1362-9 (2014) 
 
Protein-arginine deiminase type-4
Name:Protein-arginine deiminase type-4
Type:Enzyme Catalytic Domain
Mol. Mass.:74078.90
Organism:Homo sapiens (Human)
Description:gi_216548487
Residue:663
BDBM80075
NameBDBM80075
Synonyms:7-bromanyl-6-methoxy-quinoline-5,8-dione 7-bromo-6-methoxyquinoline-5,8-dione SMR001570458 | cid_265935
TypeSmall organic molecule
Emp. Form.C10H6BrNO3
Mol. Mass.268.064
SMILESCOC1=C(Br)C(=O)c2ncccc2C1=O