Reaction Details
TargetOrexin/Hypocretin receptor type 1
LigandBDBM50447804
Substrate/Competitorn/a
Meas. Tech.ChEMBL_1290419 (CHEMBL3119328)
IC50 5.0±n/a nM
Citation Sifferlen, TBoller, AChardonneau, ACottreel, EHoecker, JAissaoui, HWilliams, JTBrotschi, CHeidmann, BSiegrist, RGatfield, JTreiber, ABrisbare-Roch, CJenck, FBoss, C Discovery of substituted lactams as novel dual orexin receptor antagonists. Synthesis, preliminary structure-activity relationship studies and efforts towards improved metabolic stability and pharmacokinetic properties. Part 1. Bioorg Med Chem Lett24:1201-8 (2014) 
 
Orexin/Hypocretin receptor type 1
Name:Orexin/Hypocretin receptor type 1
Type:Protein
Mol. Mass.:47554.50
Organism:Homo sapiens (Human)
Description:O43613
Residue:425
BDBM50447804
NameBDBM50447804
Synonyms:CHEMBL3113752 | US9242970, 57
TypeSmall organic molecule
Emp. Form.C25H24N2O4
Mol. Mass.416.4691
SMILESCOc1ccnc(OC)c1C1CCCC(=O)N1Cc1ccc2oc3ccccc3c2c1