Reaction Details
TargetSucrase-isomaltase, intestinal
LigandBDBM50148911
Substrate/Competitorn/a
Meas. Tech.ChEMBL_1288549 (CHEMBL3118982)
IC50>1000000±n/a nM
Citation Thao, NPLuyen, BTTai, BHYang, SYJo, SHCuong, NXNam, NHKwon, YIMinh, CVKim, YH Rat intestinal sucrase inhibition of constituents from the roots of Rosa rugosa Thunb. Bioorg Med Chem Lett24:1192-6 (2014) 
 
Sucrase-isomaltase, intestinal
Name:Sucrase-isomaltase, intestinal
Type:Enzyme
Mol. Mass.:210329.04
Organism:Rattus norvegicus (Rat)
Description:P23739
Residue:1841
BDBM50148911
NameBDBM50148911
Synonyms:(3beta)-3-hydroxyurs-12-en-28-oic acid CHEMBL169 malol urson
TypeSmall organic molecule
Emp. Form.C30H48O3
Mol. Mass.456.7003
SMILESC[C@@H]1CC[C@@]2(CC[C@]3(C)C(=CC[C@@H]4[C@@]5(C)CC[C@H](O)C(C)(C)[C@@H]5CC[C@@]34C)[C@@H]2[C@H]1C)C(O)=O