Reaction Details
TargetPhosphatidylinositol 4-kinase alpha
LigandBDBM50448077
Substrate/Competitorn/a
Meas. Tech.ChEMBL_1292924 (CHEMBL3122829)
IC50 5.01±n/a nM
Citation Leivers, ALTallant, MShotwell, JBDickerson, SLeivers, MRMcDonald, OBGobel, JCreech, KLStrum, SLMathis, ARogers, SMoore, CBBotyanszki, J Discovery of selective small molecule type III phosphatidylinositol 4-kinase alpha (PI4KIIIa) inhibitors as anti hepatitis C (HCV) agents. J Med Chem57:2091-106 (2014) 
 
Phosphatidylinositol 4-kinase alpha
Name:Phosphatidylinositol 4-kinase alpha
Type:Protein
Mol. Mass.:231326.70
Organism:Homo sapiens (Human)
Description:P42356
Residue:2102
BDBM50448077
NameBDBM50448077
Synonyms:CHEMBL3121308
TypeSmall organic molecule
Emp. Form.C27H18F5N5O4S
Mol. Mass.603.52
SMILESCOc1ncc(cc1S(=O)(=O)Nc1ccc(F)cc1F)-c1ccc2nc(N)n(-c3ccccc3C(F)(F)F)c(=O)c2c1