Reaction Details
TargetPhosphatidylinositol 4-kinase alpha
LigandBDBM50448083
Substrate/Competitorn/a
Meas. Tech.ChEMBL_1292924 (CHEMBL3122829)
IC50 40±n/a nM
Citation Leivers, ALTallant, MShotwell, JBDickerson, SLeivers, MRMcDonald, OBGobel, JCreech, KLStrum, SLMathis, ARogers, SMoore, CBBotyanszki, J Discovery of selective small molecule type III phosphatidylinositol 4-kinase alpha (PI4KIIIa) inhibitors as anti hepatitis C (HCV) agents. J Med Chem57:2091-106 (2014) 
 
Phosphatidylinositol 4-kinase alpha
Name:Phosphatidylinositol 4-kinase alpha
Type:Protein
Mol. Mass.:231326.70
Organism:Homo sapiens (Human)
Description:P42356
Residue:2102
BDBM50448083
NameBDBM50448083
Synonyms:CHEMBL3121325
TypeSmall organic molecule
Emp. Form.C22H19F2N5O4S
Mol. Mass.487.479
SMILESCCn1c(N)nc2ccc(cc2c1=O)-c1cnc(OC)c(c1)S(=O)(=O)Nc1ccc(F)cc1F