Reaction Details
TargetPhosphatidylinositol 4-kinase alpha
LigandBDBM50448091
Substrate/Competitorn/a
Meas. Tech.ChEMBL_1292924 (CHEMBL3122829)
IC50 126±n/a nM
Citation Leivers, ALTallant, MShotwell, JBDickerson, SLeivers, MRMcDonald, OBGobel, JCreech, KLStrum, SLMathis, ARogers, SMoore, CBBotyanszki, J Discovery of selective small molecule type III phosphatidylinositol 4-kinase alpha (PI4KIIIa) inhibitors as anti hepatitis C (HCV) agents. J Med Chem57:2091-106 (2014) 
 
Phosphatidylinositol 4-kinase alpha
Name:Phosphatidylinositol 4-kinase alpha
Type:Protein
Mol. Mass.:231326.70
Organism:Homo sapiens (Human)
Description:P42356
Residue:2102
BDBM50448091
NameBDBM50448091
Synonyms:CHEMBL3121317
TypeSmall organic molecule
Emp. Form.C23H23N5O4S
Mol. Mass.465.525
SMILESCOc1ncc(cc1NS(=O)(=O)C(C)C)-c1ccc2nc(N)n(-c3ccccc3)c(=O)c2c1