Reaction Details
TargetSeed linoleate 9S-lipoxygenase
LigandBDBM32020
Substrate/Competitorn/a
Meas. Tech.ChEMBL_1293161 (CHEMBL3123291)
IC50 400000±n/a nM
Citation Kurihara, HKagawa, YKonno, RKim, SMTakahashi, K Lipoxygenase inhibitors derived from marine macroalgae. Bioorg Med Chem Lett24:1383-5 (2014) 
 
Seed linoleate 9S-lipoxygenase
Name:Seed linoleate 9S-lipoxygenase
Type:PROTEIN
Mol. Mass.:96810.33
Organism:Glycine max
Description:ChEMBL_108041
Residue:864
BDBM32020
NameBDBM32020
Synonyms:4-[4-(3,4-dihydroxyphenyl)-2,3-dimethyl-butyl]pyrocatechol 4-[4-[3,4-bis(oxidanyl)phenyl]-2,3-dimethyl-butyl]benzene-1,2-diol CHEMBL52 MLS000069451 Nordihydroguaiaretic acid (NDGA) US10857082, Compound 2.18 | cid_4534
TypeSmall organic molecule
Emp. Form.C18H22O4
Mol. Mass.302.3649
SMILESCC(Cc1ccc(O)c(O)c1)C(C)Cc1ccc(O)c(O)c1