Reaction Details
TargetCysteine proteinase falcipain 3
LigandBDBM50448246
Substrate/Competitorn/a
Meas. Tech.ChEMBL_1293361 (CHEMBL3122304)
IC50 3560±n/a nM
Citation Weldon, DJShah, FChittiboyina, AGSheri, AChada, RRGut, JRosenthal, PJShivakumar, DSherman, WDesai, PJung, JCAvery, MA Synthesis, biological evaluation, hydration site thermodynamics, and chemical reactivity analysis ofa-keto substituted peptidomimetics for the inhibition of Plasmodium falciparum. Bioorg Med Chem Lett24:1274-9 (2014) 
 
Cysteine proteinase falcipain 3
Name:Cysteine proteinase falcipain 3
Synonyms:Cysteine protease falcipain-3
Type:Protein
Mol. Mass.:56666.98
Organism:Plasmodium falciparum
Description:Q9NAW4
Residue:492
BDBM50448246
NameBDBM50448246
Synonyms:CHEMBL3120849
TypeSmall organic molecule
Emp. Form.C26H30N2O6S
Mol. Mass.498.591
SMILESCC(=O)SCC(=O)[C@H](CCc1ccccc1)NC(=O)[C@@H]1C[C@@H](O)CN1C(=O)OCc1ccccc1