Reaction Details
TargetCysteine proteinase falcipain 3
LigandBDBM50448247
Substrate/Competitorn/a
Meas. Tech.ChEMBL_1293361 (CHEMBL3122304)
IC50 520±n/a nM
Citation Weldon, DJShah, FChittiboyina, AGSheri, AChada, RRGut, JRosenthal, PJShivakumar, DSherman, WDesai, PJung, JCAvery, MA Synthesis, biological evaluation, hydration site thermodynamics, and chemical reactivity analysis ofa-keto substituted peptidomimetics for the inhibition of Plasmodium falciparum. Bioorg Med Chem Lett24:1274-9 (2014) 
 
Cysteine proteinase falcipain 3
Name:Cysteine proteinase falcipain 3
Synonyms:Cysteine protease falcipain-3
Type:Protein
Mol. Mass.:56666.98
Organism:Plasmodium falciparum
Description:Q9NAW4
Residue:492
BDBM50448247
NameBDBM50448247
Synonyms:CHEMBL3120848
TypeSmall organic molecule
Emp. Form.C33H38N2O5S
Mol. Mass.574.73
SMILESO[C@@H]1C[C@H](N(C1)C(=O)OCc1ccccc1)C(=O)N[C@@H](CCc1ccccc1)C(=O)CSCCCc1ccccc1