Reaction Details
TargetAcetylcholine receptor subunit epsilon
LigandBDBM50448375
Substrate/Competitorn/a
Meas. Tech.ChEMBL_1292388 (CHEMBL3123981)
IC50 10000±n/a nM
Citation Matera, CFlammini, LQuadri, MVivo, VBallabeni, VHolzgrabe, UMohr, KDe Amici, MBarocelli, EBertoni, SDallanoce, C Bis(ammonio)alkane-type agonists of muscarinic acetylcholine receptors: synthesis, in vitro functional characterization, and in vivo evaluation of their analgesic activity. Eur J Med Chem75:222-32 (2014) 
 
Acetylcholine receptor subunit epsilon
Name:Acetylcholine receptor subunit epsilon
Type:PROTEIN
Mol. Mass.:54930.09
Organism:Rattus norvegicus
Description:ChEMBL_1292388
Residue:494
BDBM50448375
NameBDBM50448375
Synonyms:CHEMBL3121479
TypeSmall organic molecule
Emp. Form.C34H48N4O4
Mol. Mass.576.7682
SMILESC[N+](C)(CCCCCCCC[N+](C)(C)CC#CCOC1=NOCC1)CCCN1C(=O)c2cccc3cccc(C1=O)c23