Reaction Details
TargetFatty acid-binding protein, heart
LigandBDBM50448438
Substrate/Competitorn/a
Meas. Tech.ChEMBL_1293419 (CHEMBL3122518)
Kd 74±n/a nM
Citation Tan, MCMatsuoka, SAno, HIshida, HHirose, MSato, FSugiyama, SMurata, M Interaction kinetics of liposome-incorporated unsaturated fatty acids with fatty acid-binding protein 3 by surface plasmon resonance. Bioorg Med Chem22:1804-8 (2014) 
 
Fatty acid-binding protein, heart
Name:Fatty acid-binding protein, heart
Type:PROTEIN
Mol. Mass.:14858.36
Organism:Homo sapiens (Human)
Description:ChEMBL_1463784
Residue:133
BDBM50448438
NameBDBM50448438
Synonyms:CHEMBL3122153
TypeSmall organic molecule
Emp. Form.C18H33O2
Mol. Mass.281.454
SMILESCCCCCCCC\C=C\CCCCCCCC([O-])=O