Reaction Details
TargetFatty acid-binding protein, heart
LigandBDBM50448440
Substrate/Competitorn/a
Meas. Tech.ChEMBL_1293421 (CHEMBL3122520)
Kd 3.6±n/a nM
Citation Tan, MCMatsuoka, SAno, HIshida, HHirose, MSato, FSugiyama, SMurata, M Interaction kinetics of liposome-incorporated unsaturated fatty acids with fatty acid-binding protein 3 by surface plasmon resonance. Bioorg Med Chem22:1804-8 (2014) 
 
Fatty acid-binding protein, heart
Name:Fatty acid-binding protein, heart
Type:PROTEIN
Mol. Mass.:14858.36
Organism:Homo sapiens (Human)
Description:ChEMBL_1463784
Residue:133
BDBM50448440
NameBDBM50448440
Synonyms:CHEMBL1235508
TypeSmall organic molecule
Emp. Form.C36H73NO8P
Mol. Mass.678.9399
(=O)OC[C@H](CO[P@@](O)(=O)OCC[N+](C)(C)C)OC(=O)CCCCCCCCCCCCC