Reaction Details
TargetPlatelet-derived growth factor subunit A
LigandBDBM99471
Substrate/Competitorn/a
Meas. Tech.ChEMBL_1296291 (CHEMBL3132619)
IC50 610±n/a nM
Citation Okaniwa, MHirose, MArita, TYabuki, MNakamura, ATakagi, TKawamoto, TUchiyama, NSumita, ATsutsumi, STottori, TInui, YSang, BCYano, JAertgeerts, KYoshida, SIshikawa, T Discovery of a selective kinase inhibitor (TAK-632) targeting pan-RAF inhibition: design, synthesis, and biological evaluation of C-7-substituted 1,3-benzothiazole derivatives. J Med Chem56:6478-94 (2013) 
 
Platelet-derived growth factor subunit A
Name:Platelet-derived growth factor subunit A
Type:PROTEIN
Mol. Mass.:24060.81
Organism:Homo sapiens (Human)
Description:ChEMBL_108150
Residue:211
BDBM99471
NameBDBM99471
Synonyms:US8497274, 32
TypeSmall organic molecule
Emp. Form.C27H18F4N4O3S
Mol. Mass.554.515
SMILESFc1ccc(Oc2ccc3nc(NC(=O)C4CC4)sc3c2C#N)cc1NC(=O)Cc1cccc(c1)C(F)(F)F