Reaction Details
TargetThyroid hormone receptor beta
LigandBDBM50448463
Substrate/Competitorn/a
Meas. Tech.ChEMBL_1297821 (CHEMBL3131647)
EC50 110±n/a nM
Citation Takahashi, NMaeda, KAsano, YWatanabe, N Synthesis and pharmacological characterization of 1-benzyl-4-aminoindole-based thyroid hormone receptorß agonists. Bioorg Med Chem22:488-98 (2013) 
 
Thyroid hormone receptor beta
Name:Thyroid hormone receptor beta
Type:Receptor
Mol. Mass.:52793.62
Organism:Homo sapiens (Human)
Description:Recombinant hThR was obtained from nuclear extracts from SF9 cells infected with baculovirus vectors encoding for ThRbeta 1.
Residue:461
BDBM50448463
NameBDBM50448463
Synonyms:CHEMBL3126367
TypeSmall organic molecule
Emp. Form.C21H22N2O4
Mol. Mass.366.4104
SMILESCC(C)c1cc(Cn2c(C)cc3c(NC(=O)C(O)=O)cccc23)ccc1O