Reaction Details
TargetThyroid hormone receptor beta
LigandBDBM50448461
Substrate/Competitorn/a
Meas. Tech.ChEMBL_1297822 (CHEMBL3131648)
EC50 1900±n/a nM
Citation Takahashi, NMaeda, KAsano, YWatanabe, N Synthesis and pharmacological characterization of 1-benzyl-4-aminoindole-based thyroid hormone receptorß agonists. Bioorg Med Chem22:488-98 (2013) 
 
Thyroid hormone receptor beta
Name:Thyroid hormone receptor beta
Type:Receptor
Mol. Mass.:52793.62
Organism:Homo sapiens (Human)
Description:Recombinant hThR was obtained from nuclear extracts from SF9 cells infected with baculovirus vectors encoding for ThRbeta 1.
Residue:461
BDBM50448461
NameBDBM50448461
Synonyms:CHEMBL3126370
TypeSmall organic molecule
Emp. Form.C20H20N2O4
Mol. Mass.352.3838
SMILESCC(C)c1cc(Cn2ccc3c(NC(=O)C(O)=O)cccc23)ccc1O