Reaction Details
TargetFurin
LigandBDBM50448476
Substrate/Competitorn/a
Meas. Tech.ChEMBL_1298137 (CHEMBL3129874)
Ki 89±n/a nM
Citation Gagnon, HBeauchemin, SKwiatkowska, ACouture, FD'Anjou, FLevesque, CDufour, FDesbiens, ARVaillancourt, RBernard, SDesjardins, RMalouin, FDory, YLDay, R Optimization of furin inhibitors to protect against the activation of influenza hemagglutinin H5 and Shiga toxin. J Med Chem57:29-41 (2014) 
 
Furin
Name:Furin
Type:Enzyme Catalytic Domain
Mol. Mass.:86676.01
Organism:Homo sapiens (Human)
Description:P09958
Residue:794
BDBM50448476
NameBDBM50448476
Synonyms:CHEMBL3126393
TypeSmall organic molecule
Emp. Form.C51H102N28O11
Mol. Mass.1283.5366
SMILES[#6]-[#6@@H](-[#8])-[#6@H](-[#7]-[#6](=O)-[#6@H](-[#6]-[#6]-[#6]\[#7]=[#6](/[#7])-[#7])-[#7]-[#6](=O)-[#6@H](-[#6]-[#6]-[#6]-[#6]-[#7])-[#7]-[#6](=O)-[#6@H](-[#6]-[#6]-[#6]-[#6]-[#7])-[#7]-[#6](=O)-[#6@H](-[#6]-[#6]-[#6]\[#7]=[#6](/[#7])-[#7])-[#7]-[#6](=O)-[#6]-[#7](-[#6]-[#6]-[#6]\[#7]=[#6](/[#7])-[#7])-[#7]-[#6](=O)-[#6@H](-[#6]-[#6]-[#6]\[#7]=[#6](/[#7])-[#7])-[#7]-[#6](=O)-[#6@H](-[#6])-[#7]-[#6](=O)-[#6@H](-[#6]-[#6]-[#6]\[#7]=[#6](/[#7])-[#7])-[#7]-[#6](-[#6])=O)-[#6](-[#7])=O