Reaction Details
Target11-beta-hydroxysteroid dehydrogenase 1
LigandBDBM50448731
Substrate/Competitorn/a
Meas. Tech.ChEMBL_1297892 (CHEMBL3132105)
IC50 5.4±n/a nM
Citation Goldberg, FWDossetter, AGScott, JSRobb, GRBoyd, SGroombridge, SDKemmitt, PDSjögren, TGutierrez, PMdeSchoolmeester, JSwales, JGTurnbull, AVWild, MJ Optimization of brain penetrant 11ß-hydroxysteroid dehydrogenase type I inhibitors and in vivo testing in diet-induced obese mice. J Med Chem57:970-86 (2014) 
 
11-beta-hydroxysteroid dehydrogenase 1
Name:11-beta-hydroxysteroid dehydrogenase 1
Type:Enzyme
Mol. Mass.:32369.70
Organism:Mus musculus (mouse)
Description:P50172
Residue:292
BDBM50448731
NameBDBM50448731
Synonyms:CHEMBL3127868
TypeSmall organic molecule
Emp. Form.C21H28N2O3S
Mol. Mass.388.524
SMILESO[C@@]12CC3CC(C1)[C@H](NC(=O)c1sc(OCC4CC4)nc1C1CC1)C(C3)C2