Reaction Details
Target11-beta-hydroxysteroid dehydrogenase 1
LigandBDBM50448701
Substrate/Competitorn/a
Meas. Tech.ChEMBL_1297892 (CHEMBL3132105)
IC50 12±n/a nM
Citation Goldberg, FWDossetter, AGScott, JSRobb, GRBoyd, SGroombridge, SDKemmitt, PDSjögren, TGutierrez, PMdeSchoolmeester, JSwales, JGTurnbull, AVWild, MJ Optimization of brain penetrant 11ß-hydroxysteroid dehydrogenase type I inhibitors and in vivo testing in diet-induced obese mice. J Med Chem57:970-86 (2014) 
 
11-beta-hydroxysteroid dehydrogenase 1
Name:11-beta-hydroxysteroid dehydrogenase 1
Type:Enzyme
Mol. Mass.:32369.70
Organism:Mus musculus (mouse)
Description:P50172
Residue:292
BDBM50448701
NameBDBM50448701
Synonyms:CHEMBL3127861
TypeSmall organic molecule
Emp. Form.C20H28N2O3S
Mol. Mass.376.513
SMILESCC(C)Oc1nc(C2CC2)c(s1)C(=O)N[C@H]1C2CC3CC1C[C@](O)(C3)C2