Reaction Details
Target11-beta-hydroxysteroid dehydrogenase 1
LigandBDBM50448693
Substrate/Competitorn/a
Meas. Tech.ChEMBL_1297892 (CHEMBL3132105)
IC50 12±n/a nM
Citation Goldberg, FWDossetter, AGScott, JSRobb, GRBoyd, SGroombridge, SDKemmitt, PDSjögren, TGutierrez, PMdeSchoolmeester, JSwales, JGTurnbull, AVWild, MJ Optimization of brain penetrant 11ß-hydroxysteroid dehydrogenase type I inhibitors and in vivo testing in diet-induced obese mice. J Med Chem57:970-86 (2014) 
 
11-beta-hydroxysteroid dehydrogenase 1
Name:11-beta-hydroxysteroid dehydrogenase 1
Type:Enzyme
Mol. Mass.:32369.70
Organism:Mus musculus (mouse)
Description:P50172
Residue:292
BDBM50448693
NameBDBM50448693
Synonyms:CHEMBL3127857
TypeSmall organic molecule
Emp. Form.C23H29N3O4S
Mol. Mass.443.559
SMILESOC12CC3CC(C1)C(NC(=O)c1sc(OC4CC(C4)C#N)nc1[C@H]1CCCO1)C(C3)C2