Reaction Details
Target11-beta-hydroxysteroid dehydrogenase 1
LigandBDBM50448704
Substrate/Competitorn/a
Meas. Tech.ChEMBL_1297892 (CHEMBL3132105)
IC50 8.9±n/a nM
Citation Goldberg, FWDossetter, AGScott, JSRobb, GRBoyd, SGroombridge, SDKemmitt, PDSjögren, TGutierrez, PMdeSchoolmeester, JSwales, JGTurnbull, AVWild, MJ Optimization of brain penetrant 11ß-hydroxysteroid dehydrogenase type I inhibitors and in vivo testing in diet-induced obese mice. J Med Chem57:970-86 (2014) 
 
11-beta-hydroxysteroid dehydrogenase 1
Name:11-beta-hydroxysteroid dehydrogenase 1
Type:Enzyme
Mol. Mass.:32369.70
Organism:Mus musculus (mouse)
Description:P50172
Residue:292
BDBM50448704
NameBDBM50448704
Synonyms:CHEMBL3127856
TypeSmall organic molecule
Emp. Form.C22H32N2O5S
Mol. Mass.436.565
SMILESCOC[C@H](C)Oc1nc([C@H]2CCCO2)c(s1)C(=O)NC1C2CC3CC1CC(O)(C3)C2