Reaction Details
TargetSerine/threonine-protein kinase PAK 3
LigandBDBM50448771
Substrate/Competitorn/a
Meas. Tech.ChEMBL_1294406 (CHEMBL3129191)
IC50>10000±n/a nM
Citation Staben, STFeng, JALyle, KBelvin, MBoggs, JBurch, JDChua, CCCui, HDiPasquale, AGFriedman, LSHeise, CKoeppen, HKotey, AMintzer, ROh, ARoberts, DARouge, LRudolph, JTam, CWang, WXiao, YYoung, AZhang, YHoeflich, KP Back pocket flexibility provides group II p21-activated kinase (PAK) selectivity for type I 1/2 kinase inhibitors. J Med Chem57:1033-45 (2014) 
 
Serine/threonine-protein kinase PAK 3
Name:Serine/threonine-protein kinase PAK 3
Type:Enzyme
Mol. Mass.:62298.33
Organism:Homo sapiens (Human)
Description:O75914
Residue:559
BDBM50448771
NameBDBM50448771
Synonyms:CHEMBL3128042
TypeSmall organic molecule
Emp. Form.C22H26N6O2
Mol. Mass.406.4808
SMILESCOCCNc1nc2ccc(cc2n1-c1ccnc(N)n1)C#CC1(O)CCCCC1