Reaction Details
TargetAldehyde dehydrogenase, mitochondrial
LigandBDBM50448790
Substrate/Competitorn/a
Meas. Tech.ChEMBL_1295315 (CHEMBL3128582)
Ki 2200±n/a nM
Citation Kimble-Hill, ACParajuli, BChen, CHMochly-Rosen, DHurley, TD Development of selective inhibitors for aldehyde dehydrogenases based on substituted indole-2,3-diones. J Med Chem57:714-22 (2014) 
 
Aldehyde dehydrogenase, mitochondrial
Name:Aldehyde dehydrogenase, mitochondrial
Type:Enzyme
Mol. Mass.:56382.67
Organism:Homo sapiens (Human)
Description:P05091
Residue:517
BDBM50448790
NameBDBM50448790
Synonyms:CHEMBL3128208
TypeSmall organic molecule
Emp. Form.C9H6BrNO2
Mol. Mass.240.053
SMILESCc1cc2C(=O)C(=O)Nc2c(Br)c1