Reaction Details
TargetAldehyde dehydrogenase, mitochondrial
LigandBDBM50448801
Substrate/Competitorn/a
Meas. Tech.ChEMBL_1295317 (CHEMBL3130565)
IC50 100±n/a nM
Citation Kimble-Hill, ACParajuli, BChen, CHMochly-Rosen, DHurley, TD Development of selective inhibitors for aldehyde dehydrogenases based on substituted indole-2,3-diones. J Med Chem57:714-22 (2014) 
 
Aldehyde dehydrogenase, mitochondrial
Name:Aldehyde dehydrogenase, mitochondrial
Type:Enzyme
Mol. Mass.:56382.67
Organism:Homo sapiens (Human)
Description:P05091
Residue:517
BDBM50448801
NameBDBM50448801
Synonyms:CHEMBL3128203
TypeSmall organic molecule
Emp. Form.C17H12ClNO2
Mol. Mass.297.736
SMILESClc1ccc2N(C\C=C\c3ccccc3)C(=O)C(=O)c2c1