Reaction Details
TargetAldehyde dehydrogenase 1A1
LigandBDBM50448798
Substrate/Competitorn/a
Meas. Tech.ChEMBL_1295319 (CHEMBL3130567)
IC50 4000±n/a nM
Citation Kimble-Hill, ACParajuli, BChen, CHMochly-Rosen, DHurley, TD Development of selective inhibitors for aldehyde dehydrogenases based on substituted indole-2,3-diones. J Med Chem57:714-22 (2014) 
 
Aldehyde dehydrogenase 1A1
Name:Aldehyde dehydrogenase 1A1
Type:Protein
Mol. Mass.:54862.21
Organism:Homo sapiens (Human)
Description:n/a
Residue:501
BDBM50448798
NameBDBM50448798
Synonyms:CHEMBL3128217
TypeSmall organic molecule
Emp. Form.C20H20FN3O2
Mol. Mass.353.3901
SMILESFc1ccccc1CN1CCN(CN2C(=O)C(=O)c3ccccc23)CC1