Reaction Details
TargetAldehyde dehydrogenase 1A1
LigandBDBM50448803
Substrate/Competitorn/a
Meas. Tech.ChEMBL_1295319 (CHEMBL3130567)
IC50 90±n/a nM
Citation Kimble-Hill, ACParajuli, BChen, CHMochly-Rosen, DHurley, TD Development of selective inhibitors for aldehyde dehydrogenases based on substituted indole-2,3-diones. J Med Chem57:714-22 (2014) 
 
Aldehyde dehydrogenase 1A1
Name:Aldehyde dehydrogenase 1A1
Type:Protein
Mol. Mass.:54862.21
Organism:Homo sapiens (Human)
Description:n/a
Residue:501
BDBM50448803
NameBDBM50448803
Synonyms:CHEMBL3128206
TypeSmall organic molecule
Emp. Form.C16H12ClNO2
Mol. Mass.285.725
SMILESClc1ccc2N(CCc3ccccc3)C(=O)C(=O)c2c1