Reaction Details
TargetSerine/threonine-protein kinase TBK1
LigandBDBM50448992
Substrate/Competitorn/a
Meas. Tech.ChEMBL_1297370 (CHEMBL3132510)
IC50 7.0±n/a nM
Citation Johannes, JWChuaqui, CCowen, SDevereaux, EGingipalli, LMolina, AWang, TWhitston, DWu, XZhang, HJZinda, M Discovery of 6-aryl-azabenzimidaoles that inhibit the TBK1/IKK-e kinases. Bioorg Med Chem Lett24:1138-43 (2014) 
 
Serine/threonine-protein kinase TBK1
Name:Serine/threonine-protein kinase TBK1
Type:protein
Mol. Mass.:83645.20
Organism:Homo sapiens (Human)
Description:Q9UHD2
Residue:729
BDBM50448992
NameBDBM50448992
Synonyms:CHEMBL3125721
TypeSmall organic molecule
Emp. Form.C26H29N7O3S
Mol. Mass.519.619
SMILESCOc1ccc(cc1)-c1nc2ncc(-c3nc(cs3)C(N)=O)c(NCCCNC(=O)C3CCCC3)c2[nH]1