Reaction Details
TargetProgesterone receptor
LigandBDBM50449077
Substrate/Competitorn/a
Meas. Tech.ChEMBL_1295698 (CHEMBL3132585)
IC50 490±n/a nM
Citation Harcken, CRiether, DKuzmich, DLiu, PBetageri, RRalph, MEmmanuel, MReeves, JTBerry, ASouza, DNelson, RMKukulka, AFadra, TNZuvela-Jelaska, LDinallo, RBentzien, JNabozny, GHThomson, DS Identification of highly efficacious glucocorticoid receptor agonists with a potential for reduced clinical bone side effects. J Med Chem57:1583-98 (2014) 
 
Progesterone receptor
Name:Progesterone receptor
Type:Protein
Mol. Mass.:98979.52
Organism:Homo sapiens (Human)
Description:P06401
Residue:933
BDBM50449077
NameBDBM50449077
Synonyms:CHEMBL3126951
TypeSmall organic molecule
Emp. Form.C20H21F4N3O
Mol. Mass.395.3939
SMILESCc1ccc(F)cc1C(C)(C)CC(O)(Cc1cc2cnncc2[nH]1)C(F)(F)F