Reaction Details
TargetGlucocorticoid receptor
LigandBDBM50449068
Substrate/Competitorn/a
Meas. Tech.ChEMBL_1295696 (CHEMBL3132583)
IC50 130±n/a nM
Citation Harcken, CRiether, DKuzmich, DLiu, PBetageri, RRalph, MEmmanuel, MReeves, JTBerry, ASouza, DNelson, RMKukulka, AFadra, TNZuvela-Jelaska, LDinallo, RBentzien, JNabozny, GHThomson, DS Identification of highly efficacious glucocorticoid receptor agonists with a potential for reduced clinical bone side effects. J Med Chem57:1583-98 (2014) 
 
Glucocorticoid receptor
Name:Glucocorticoid receptor
Type:Enzyme
Mol. Mass.:85656.87
Organism:Homo sapiens (Human)
Description:P04150
Residue:777
BDBM50449068
NameBDBM50449068
Synonyms:CHEMBL3126937
TypeSmall organic molecule
Emp. Form.C24H28F4N4O
Mol. Mass.464.4989
SMILESCc1ccc(F)cc1C(C)(C)CC(O)(Cc1cc2nc(ncc2[nH]1)N1CCCC1)C(F)(F)F