Reaction Details
TargetMineralocorticoid receptor
LigandBDBM50449066
Substrate/Competitorn/a
Meas. Tech.ChEMBL_1295697 (CHEMBL3132584)
IC50>2000±n/a nM
Citation Harcken, CRiether, DKuzmich, DLiu, PBetageri, RRalph, MEmmanuel, MReeves, JTBerry, ASouza, DNelson, RMKukulka, AFadra, TNZuvela-Jelaska, LDinallo, RBentzien, JNabozny, GHThomson, DS Identification of highly efficacious glucocorticoid receptor agonists with a potential for reduced clinical bone side effects. J Med Chem57:1583-98 (2014) 
 
Mineralocorticoid receptor
Name:Mineralocorticoid receptor
Type:Enzyme
Mol. Mass.:107076.42
Organism:Homo sapiens (Human)
Description:P08235
Residue:984
BDBM50449066
NameBDBM50449066
Synonyms:CHEMBL3126939
TypeSmall organic molecule
Emp. Form.C24H28F4N4O3S
Mol. Mass.528.563
SMILESCc1ccc(F)cc1C(C)(C)CC(O)(Cc1cc2nc(ncc2[nH]1)N1CCS(=O)(=O)CC1)C(F)(F)F