Reaction Details
TargetMineralocorticoid receptor
LigandBDBM50449076
Substrate/Competitorn/a
Meas. Tech.ChEMBL_1295697 (CHEMBL3132584)
IC50>2000±n/a nM
Citation Harcken, CRiether, DKuzmich, DLiu, PBetageri, RRalph, MEmmanuel, MReeves, JTBerry, ASouza, DNelson, RMKukulka, AFadra, TNZuvela-Jelaska, LDinallo, RBentzien, JNabozny, GHThomson, DS Identification of highly efficacious glucocorticoid receptor agonists with a potential for reduced clinical bone side effects. J Med Chem57:1583-98 (2014) 
 
Mineralocorticoid receptor
Name:Mineralocorticoid receptor
Type:Enzyme
Mol. Mass.:107076.42
Organism:Homo sapiens (Human)
Description:P08235
Residue:984
BDBM50449076
NameBDBM50449076
Synonyms:CHEMBL3126952
TypeSmall organic molecule
Emp. Form.C26H25F4N3O
Mol. Mass.471.4898
SMILESCc1ccc(F)cc1C(C)(C)CC(O)(Cc1cc2cc(nnc2[nH]1)-c1ccccc1)C(F)(F)F