Reaction Details
TargetXanthine dehydrogenase/oxidase
LigandBDBM50449100
Substrate/Competitorn/a
Meas. Tech.ChEMBL_1296859 (CHEMBL3129609)
IC50 0.631000±n/a nM
Citation Evenäs, JEdfeldt, FLepistö, MSvitacheva, NSynnergren, ALundquist, BGränse, MRönnholm, AVarga, MWright, JWei, MYue, SWang, JLi, CLi, XChen, GLiao, YLv, GTjörnebo, ANarjes, F HTS followed by NMR based counterscreening. Discovery and optimization of pyrimidones as reversible and competitive inhibitors of xanthine oxidase. Bioorg Med Chem Lett24:1315-21 (2014) 
 
Xanthine dehydrogenase/oxidase
Name:Xanthine dehydrogenase/oxidase
Type:Enzyme
Mol. Mass.:146441.21
Organism:Homo sapiens (Human)
Description:P47989
Residue:1333
BDBM50449100
NameBDBM50449100
Synonyms:CHEMBL3127135
TypeSmall organic molecule
Emp. Form.C17H15F3N4O4
Mol. Mass.396.3206
SMILESNc1nc(-c2ccc(OCC3CCOC3)c(OC(F)(F)F)c2)c(C#N)c(=O)[nH]1