Reaction Details
TargetXanthine dehydrogenase/oxidase
LigandBDBM50449108
Substrate/Competitorn/a
Meas. Tech.ChEMBL_1296862 (CHEMBL3129612)
IC50 1.3±n/a nM
Citation Evenäs, JEdfeldt, FLepistö, MSvitacheva, NSynnergren, ALundquist, BGränse, MRönnholm, AVarga, MWright, JWei, MYue, SWang, JLi, CLi, XChen, GLiao, YLv, GTjörnebo, ANarjes, F HTS followed by NMR based counterscreening. Discovery and optimization of pyrimidones as reversible and competitive inhibitors of xanthine oxidase. Bioorg Med Chem Lett24:1315-21 (2014) 
 
Xanthine dehydrogenase/oxidase
Name:Xanthine dehydrogenase/oxidase
Type:Enzyme
Mol. Mass.:146441.21
Organism:Homo sapiens (Human)
Description:P47989
Residue:1333
BDBM50449108
NameBDBM50449108
Synonyms:CHEMBL3127134
TypeSmall organic molecule
Emp. Form.C16H13N5O2
Mol. Mass.307.3067
SMILESNc1nc(-c2ccc(OCC3CC3)c(c2)C#N)c(C#N)c(=O)[nH]1