Reaction Details
TargetXanthine dehydrogenase/oxidase
LigandBDBM26193
Substrate/Competitorn/a
Meas. Tech.ChEMBL_1296858 (CHEMBL3129608)
Ki 100000000±n/a nM
Citation Evenäs, JEdfeldt, FLepistö, MSvitacheva, NSynnergren, ALundquist, BGränse, MRönnholm, AVarga, MWright, JWei, MYue, SWang, JLi, CLi, XChen, GLiao, YLv, GTjörnebo, ANarjes, F HTS followed by NMR based counterscreening. Discovery and optimization of pyrimidones as reversible and competitive inhibitors of xanthine oxidase. Bioorg Med Chem Lett24:1315-21 (2014) 
 
Xanthine dehydrogenase/oxidase
Name:Xanthine dehydrogenase/oxidase
Type:Protein
Mol. Mass.:146809.00
Organism:Bos taurus (Bovine)
Description:P80457
Residue:1332
BDBM26193
NameBDBM26193
Synonyms:2-Hydroxybenzoate, I CHEMBL424 salicylic acid
TypeSmall organic molecule
Emp. Form.C7H6O3
Mol. Mass.138.1207
SMILESOC(=O)c1ccccc1O