Reaction Details
TargetPresequence protease, mitochondrial
LigandBDBM50449404
Substrate/Competitorn/a
Meas. Tech.ChEMBL_1294277 (CHEMBL3128954)
EC50 402±n/a nM
Citation Vangavaragu, JRValasani, KRGan, XYan, SS Identification of human presequence protease (hPreP) agonists for the treatment of Alzheimer's disease. Eur J Med Chem76:506-16 (2014) 
 
Presequence protease, mitochondrial
Name:Presequence protease, mitochondrial
Type:PROTEIN
Mol. Mass.:117419.85
Organism:Homo sapiens (Human)
Description:ChEMBL_108043
Residue:1037
BDBM50449404
NameBDBM50449404
Synonyms:CHEMBL3127263
TypeSmall organic molecule
Emp. Form.C27H20Br3N3O5
Mol. Mass.706.177
SMILESOc1ccc(Br)cc1CN1C(N(Cc2cc(Br)ccc2O)c2cc(ccc12)[N+]([O-])=O)c1cc(Br)ccc1O