Reaction Details
TargetGlutamate receptor ionotropic, NMDA 1/2B
LigandBDBM50124885
Substrate/Competitorn/a
Meas. Tech.ChEMBL_141289 (CHEMBL747356)
IC50 26000±n/a nM
Citation Curtis, NRDiggle, HJKulagowski, JJLondon, CGrimwood, SHutson, PHMurray, FRichards, PMacaulay, AWafford, KA Novel N1-(benzyl)cinnamamidine derived NR2B subtype-selective NMDA receptor antagonists. Bioorg Med Chem Lett13:693-6 (2003) Glutamate receptor ionotropic, NMDA 1/2B
Name:Glutamate receptor ionotropic, NMDA 1/2B
Type:Enzyme
Mol. Mass.:n/a
Description:n/a
Components:This complex has 2 components.
Component 1
Name:Glutamate receptor ionotropic, NMDA 1
Synonyms:GRIN1 Glutamate [NMDA] receptor subunit zeta-1 N-methyl-D-aspartate receptor subunit NR1 NMDZ1_HUMAN | phencyclidine
Type:Enzyme Catalytic Domain
Mol. Mass.:105397.81
Organism:Homo sapiens (Human)
Description:Q05586
Residue:938
Component 2
Name:Glutamate receptor ionotropic, NMDA 2B
Synonyms:GRIN2B Glutamate [NMDA] receptor subunit epsilon 2 N-methyl D-aspartate receptor subtype 2B NMDAR2B NR3 | hNR3
Type:PROTEIN
Mol. Mass.:166375.46
Organism:Homo sapiens (Human)
Description:ChEMBL_1438829
Residue:1484
BDBM50124885
NameBDBM50124885
Synonyms:(E)-N-(2-Methoxy-benzyl)-3-phenyl-acrylamidine N-(2-methoxybenzyl)cinnamamidine
TypeSmall organic molecule
Emp. Form.C17H18N2O
Mol. Mass.266.3376
SMILESCOc1ccccc1CN=C(N)C=Cc1ccccc1