Reaction Details
TargetGlutamate receptor ionotropic, NMDA 1/2B
LigandBDBM50451788
Substrate/Competitorn/a
Meas. Tech.ChEMBL_141291 (CHEMBL747358)
Ki 77±n/a nM
Citation Curtis, NRDiggle, HJKulagowski, JJLondon, CGrimwood, SHutson, PHMurray, FRichards, PMacaulay, AWafford, KA Novel N1-(benzyl)cinnamamidine derived NR2B subtype-selective NMDA receptor antagonists. Bioorg Med Chem Lett13:693-6 (2003) Glutamate receptor ionotropic, NMDA 1/2B
Name:Glutamate receptor ionotropic, NMDA 1/2B
Type:Enzyme
Mol. Mass.:n/a
Description:n/a
Components:This complex has 2 components.
Component 1
Name:Glutamate receptor ionotropic, NMDA 1
Synonyms:GRIN1 Glutamate [NMDA] receptor subunit zeta-1 N-methyl-D-aspartate receptor subunit NR1 NMDZ1_HUMAN | phencyclidine
Type:Enzyme Catalytic Domain
Mol. Mass.:105397.81
Organism:Homo sapiens (Human)
Description:Q05586
Residue:938
Component 2
Name:Glutamate receptor ionotropic, NMDA 2B
Synonyms:GRIN2B Glutamate [NMDA] receptor subunit epsilon 2 N-methyl D-aspartate receptor subtype 2B NMDAR2B NR3 | hNR3
Type:PROTEIN
Mol. Mass.:166375.46
Organism:Homo sapiens (Human)
Description:ChEMBL_1438829
Residue:1484
BDBM50451788
NameBDBM50451788
Synonyms:CHEMBL161008
TypeSmall organic molecule
Emp. Form.C16H15ClN2
Mol. Mass.270.757
SMILESClc1ccc(CNC(=N)\C=C\c2ccccc2)cc1