Reaction Details
TargetSubstance-P receptor
LigandBDBM50421573
Substrate/Competitorn/a
Meas. Tech.ChEMBL_205901 (CHEMBL814485)
Ki 5±n/a nM
Citation Genicot, CChristophe, BCollart, PGillard, MGoossens, LHénichart, JPLassoie, MAMoureau, FNeuwels, MNicolas, JMPasau, PQuéré, LRyckmans, TStiernet, FTaverne, TVan Keulen, BJ Discovery of orally bioavailable NK1 receptor antagonists. Bioorg Med Chem Lett13:437-42 (2003) Substance-P receptor
Name:Substance-P receptor
Type:G Protein-Coupled Receptor (GPCR)
Mol. Mass.:46254.43
Organism:Homo sapiens (Human)
Description:P25103
Residue:407
BDBM50421573
NameBDBM50421573
Synonyms:CHEMBL321892
TypeSmall organic molecule
Emp. Form.C21H21F7N2O
Mol. Mass.450.3931
SMILESFc1ccccc1C(COCc1cc(cc(c1)C(F)(F)F)C(F)(F)F)N1CCNCC1