Reaction Details
TargetSubstance-P receptor
LigandBDBM50000236
Substrate/Competitorn/a
Meas. Tech.ChEMBL_205901 (CHEMBL814485)
Ki 1.6±n/a nM
Citation Genicot, CChristophe, BCollart, PGillard, MGoossens, LHénichart, JPLassoie, MAMoureau, FNeuwels, MNicolas, JMPasau, PQuéré, LRyckmans, TStiernet, FTaverne, TVan Keulen, BJ Discovery of orally bioavailable NK1 receptor antagonists. Bioorg Med Chem Lett13:437-42 (2003) Substance-P receptor
Name:Substance-P receptor
Type:G Protein-Coupled Receptor (GPCR)
Mol. Mass.:46254.43
Organism:Homo sapiens (Human)
Description:P25103
Residue:407
BDBM50000236
NameBDBM50000236
Synonyms:CHEMBL140080
TypeSmall organic molecule
Emp. Form.C22H24F6N2O
Mol. Mass.446.4292
SMILESCN1CCN(CC1)C(COCc1cc(cc(c1)C(F)(F)F)C(F)(F)F)c1ccccc1