Reaction Details
TargetSubstance-P receptor
LigandBDBM50000239
Substrate/Competitorn/a
Meas. Tech.ChEMBL_205901 (CHEMBL814485)
Ki 2±n/a nM
Citation Genicot, CChristophe, BCollart, PGillard, MGoossens, LHénichart, JPLassoie, MAMoureau, FNeuwels, MNicolas, JMPasau, PQuéré, LRyckmans, TStiernet, FTaverne, TVan Keulen, BJ Discovery of orally bioavailable NK1 receptor antagonists. Bioorg Med Chem Lett13:437-42 (2003) Substance-P receptor
Name:Substance-P receptor
Type:G Protein-Coupled Receptor (GPCR)
Mol. Mass.:46254.43
Organism:Homo sapiens (Human)
Description:P25103
Residue:407
BDBM50000239
NameBDBM50000239
Synonyms:CHEMBL342266
TypeSmall organic molecule
Emp. Form.C27H27F6N3O
Mol. Mass.523.5132
SMILESFC(F)(F)c1cc(COCC(N2CCN(Cc3ccccn3)CC2)c2ccccc2)cc(c1)C(F)(F)F