Reaction Details
TargetSubstance-P receptor
LigandBDBM50000240
Substrate/Competitorn/a
Meas. Tech.ChEMBL_205901 (CHEMBL814485)
Ki 1±n/a nM
Citation Genicot, CChristophe, BCollart, PGillard, MGoossens, LHénichart, JPLassoie, MAMoureau, FNeuwels, MNicolas, JMPasau, PQuéré, LRyckmans, TStiernet, FTaverne, TVan Keulen, BJ Discovery of orally bioavailable NK1 receptor antagonists. Bioorg Med Chem Lett13:437-42 (2003) Substance-P receptor
Name:Substance-P receptor
Type:G Protein-Coupled Receptor (GPCR)
Mol. Mass.:46254.43
Organism:Homo sapiens (Human)
Description:P25103
Residue:407
BDBM50000240
NameBDBM50000240
Synonyms:CHEMBL435796
TypeSmall organic molecule
Emp. Form.C22H24F6N2O
Mol. Mass.446.4292
SMILESCc1ccccc1C(COCc1cc(cc(c1)C(F)(F)F)C(F)(F)F)N1CCNCC1