Reaction Details
TargetSubstance-P receptor
LigandBDBM50000250
Substrate/Competitorn/a
Meas. Tech.ChEMBL_205901 (CHEMBL814485)
Ki 3.2±n/a nM
Citation Genicot, CChristophe, BCollart, PGillard, MGoossens, LHénichart, JPLassoie, MAMoureau, FNeuwels, MNicolas, JMPasau, PQuéré, LRyckmans, TStiernet, FTaverne, TVan Keulen, BJ Discovery of orally bioavailable NK1 receptor antagonists. Bioorg Med Chem Lett13:437-42 (2003) Substance-P receptor
Name:Substance-P receptor
Type:G Protein-Coupled Receptor (GPCR)
Mol. Mass.:46254.43
Organism:Homo sapiens (Human)
Description:P25103
Residue:407
BDBM50000250
NameBDBM50000250
Synonyms:CHEMBL337789
TypeSmall organic molecule
Emp. Form.C25H29F6N3O3
Mol. Mass.533.5065
SMILESNC(=O)COCCN1CCN(CC1)C(COCc1cc(cc(c1)C(F)(F)F)C(F)(F)F)c1ccccc1