Reaction Details
Target5-hydroxytryptamine receptor 3A/3B
LigandBDBM50449636
Substrate/Competitorn/a
Meas. Tech.ChEMBL_3411 (CHEMBL620725)
Ki 0.79±n/a nM
Citation Clark, RDMiller, ABBerger, JRepke, DBWeinhardt, KKKowalczyk, BAEglen, RMBonhaus, DWLee, CHMichel, AD 2-(Quinuclidin-3-yl)pyrido[4,3-b]indol-1-ones and isoquinolin-1-ones. Potent conformationally restricted 5-HT3 receptor antagonists. J Med Chem36:2645-57 (1993) 5-hydroxytryptamine receptor 3A/3B
Name:5-hydroxytryptamine receptor 3A/3B
Type:n/a
Mol. Mass.:n/a
Description:ASSAY_ID of EBI is 2974
Components:This complex has 2 components.
Component 1
Name:5-hydroxytryptamine receptor 3B
Synonyms:5HT3B_RAT Serotonin (5-HT) receptor
Type:PROTEIN
Mol. Mass.:50328.78
Organism:Rattus norvegicus
Description:EBI_11885
Residue:437
Component 2
Name:5-hydroxytryptamine receptor 3A
Synonyms:5-HT3 5HT3A_RAT Htr3 Serotonin (5-HT) receptor | Zacopride site-R
Type:Enzyme Catalytic Domain
Mol. Mass.:55428.70
Organism:RAT
Description:5-HT3 HTR3A RAT::P35563
Residue:483
BDBM50449636
NameBDBM50449636
Synonyms:BRL-43694 Kytril Sancuso
TypeSmall organic molecule
Emp. Form.C18H24N4O
Mol. Mass.312.4094
SMILES[H][C@]12CCC[C@]([H])(C[C@H](C1)NC(=O)c1nn(C)c3ccccc13)N2C