Reaction Details
TargetSerine/threonine-protein kinase pim-1
LigandBDBM11833
Substrate/Competitorn/a
Meas. Tech.ChEMBL_326168 (CHEMBL864489)
Kd 72±n/a nM
Citation Bullock, ANDebreczeni, JEFedorov, OYNelson, AMarsden, BDKnapp, S Structural basis of inhibitor specificity of the human protooncogene proviral insertion site in moloney murine leukemia virus (PIM-1) kinase. J Med Chem48:7604-14 (2005) 
 
Serine/threonine-protein kinase pim-1
Name:Serine/threonine-protein kinase pim-1
Type:Protein
Mol. Mass.:35681.82
Organism:Homo sapiens (Human)
Description:P11309
Residue:313
BDBM11833
NameBDBM11833
Synonyms:3-[2-(aminomethyl)-1H,2H,3H,4H-pyrido[1,2-a]indol-10-yl]-4-(1H-indol-3-yl)-2,5-dihydro-1H-pyrrole-2,5-dione | BIM-10
TypeSmall organic molecule
Emp. Form.C25H22N4O2
Mol. Mass.410.4678
SMILESNCC1CCn2c(C1)c(C1=C(C(=O)NC1=O)c1c[nH]c3ccccc13)c1ccccc21