Reaction Details
TargetProthrombin
LigandBDBM50003298
Substrate/Competitorn/a
Meas. Tech.ChEMBL_548421 (CHEMBL1030955)
IC50 62600±n/a nM
Citation Kimura, JIshizuka, ENakao, YYoshida, WYScheuer, PJKelly-Borges, M Isolation of 1-Methylherbipoline Salts of Halisulfate-1 and of Suvanine as Serine Protease Inhibitors from a Marine Sponge, Coscinoderma mathewsi J Nat Prod61:248-50 (1998) 
 
Prothrombin
Name:Prothrombin
Type:Protein
Mol. Mass.:70029.57
Organism:Homo sapiens (Human)
Description:P00734
Residue:622
BDBM50003298
NameBDBM50003298
Synonyms:halisulphatesodium
TypeSmall organic molecule
Emp. Form.C30H47NaO6S
Mol. Mass.558.745
SMILES[Na+].[H][C@@]12CCC[C@@H](C[C@@H](OS([O-])(=O)=O)[C@H](C)CCC\C(C)=C\Cc3cc(O)ccc3O)[C@]1(C)CCCC2(C)C