Reaction Details
TargetSolute carrier organic anion transporter family member 2B1
LigandBDBM50035622
Substrate/Competitorn/a
Meas. Tech.ChEMBL_836786 (CHEMBL2075311)
IC50 287±n/a nM
Citation Nishio, TAdachi, HNakagomi, RTokui, TSato, ETanemoto, MFujiwara, KOkabe, MOnogawa, TSuzuki, TNakai, DShiiba, KSuzuki, MOhtani, HKondo, YUnno, MIto, SIinuma, KNunoki, KMatsuno, SAbe, T Molecular identification of a rat novel organic anion transporter moat1, which transports prostaglandin D(2), leukotriene C(4), and taurocholate. Biochem Biophys Res Commun275:831-8 (2000) 
 
Solute carrier organic anion transporter family member 2B1
Name:Solute carrier organic anion transporter family member 2B1
Type:PROTEIN
Mol. Mass.:74232.20
Organism:Rattus norvegicus
Description:ChEMBL_104639
Residue:682
BDBM50035622
NameBDBM50035622
Synonyms:(5Z,13E,15S)-9alpha,11alpha,15-trihydroxyprosta-5,13-dien-1-oic acid DINOPROST l-PGF2-alpha prostaglandin F2alpha
TypeSmall organic molecule
Emp. Form.C20H34O5
Mol. Mass.354.481
SMILESCCCCC[C@H](O)\C=C\[C@H]1[C@H](O)C[C@H](O)[C@@H]1C\C=C/CCCC(O)=O