Reaction Details
TargetCannabinoid receptor 2
LigandBDBM50005291
Substrate/Competitorn/a
Meas. Tech.ChEMBL_1291359 (CHEMBL3117775)
EC50 15±n/a nM
Citation Nanda, KKHenze, DADella Penna, KDesai, RLeitl, MLemaire, WWhite, RBYeh, SBrouillette, JNHartman, GDBilodeau, MTTrotter, BW Benzimidazole CB2 agonists: design, synthesis and SAR. Bioorg Med Chem Lett24:1218-21 (2014) 
 
Cannabinoid receptor 2
Name:Cannabinoid receptor 2
Type:G Protein-Coupled Receptor (GPCR)
Mol. Mass.:39690.94
Organism:Homo sapiens (Human)
Description:P34972
Residue:360
BDBM50005291
NameBDBM50005291
Synonyms:CHEMBL3114526
TypeSmall organic molecule
Emp. Form.C19H21N3O
Mol. Mass.307.3895
SMILESCC(C)(C)CNC(=O)c1nc2c(cccc2[nH]1)-c1ccccc1