Reaction Details
TargetCannabinoid receptor 1
LigandBDBM50005282
Substrate/Competitorn/a
Meas. Tech.ChEMBL_1291356 (CHEMBL3117772)
IC50 3881±n/a nM
Citation Nanda, KKHenze, DADella Penna, KDesai, RLeitl, MLemaire, WWhite, RBYeh, SBrouillette, JNHartman, GDBilodeau, MTTrotter, BW Benzimidazole CB2 agonists: design, synthesis and SAR. Bioorg Med Chem Lett24:1218-21 (2014) 
 
Cannabinoid receptor 1
Name:Cannabinoid receptor 1
Type:G Protein-Coupled Receptor (GPCR)
Mol. Mass.:52868.96
Organism:Homo sapiens (Human)
Description:P21554
Residue:472
BDBM50005282
NameBDBM50005282
Synonyms:CHEMBL3114534
TypeSmall organic molecule
Emp. Form.C24H26N4O2
Mol. Mass.402.4888
SMILESOC(c1nc(C(=O)NC23CC4CC(CC(C4)C2)C3)n2ccccc12)c1cccnc1