Reaction Details
TargetCannabinoid receptor 1
LigandBDBM50005285
Substrate/Competitorn/a
Meas. Tech.ChEMBL_1291356 (CHEMBL3117772)
EC50>17000±n/a nM
Citation Nanda, KKHenze, DADella Penna, KDesai, RLeitl, MLemaire, WWhite, RBYeh, SBrouillette, JNHartman, GDBilodeau, MTTrotter, BW Benzimidazole CB2 agonists: design, synthesis and SAR. Bioorg Med Chem Lett24:1218-21 (2014) 
 
Cannabinoid receptor 1
Name:Cannabinoid receptor 1
Type:G Protein-Coupled Receptor (GPCR)
Mol. Mass.:52868.96
Organism:Homo sapiens (Human)
Description:P21554
Residue:472
BDBM50005285
NameBDBM50005285
Synonyms:CHEMBL3114531
TypeSmall organic molecule
Emp. Form.C24H26F3N3O2
Mol. Mass.445.4773
SMILESOCC1(CNC(=O)c2nc3c(cccc3n2CC(F)(F)F)-c2ccccc2)CCCCC1