Reaction Details
TargetThymidine kinase, cytosolic
LigandBDBM50000971
Substrate/Competitorn/a
Meas. Tech.ChEMBL_1333876 (CHEMBL3231765)
Ki 160000±n/a nM
Citation Hampton, AKappler, FChawla, RR Design of species- or isozyme-specific enzyme inhibitors. 1. Effect of thymidine substituents on affinity for the thymidine site of hamster cytoplasmic thymidine kinase. J Med Chem22:621-31 (1979) Thymidine kinase, cytosolic
Name:Thymidine kinase, cytosolic
Type:PROTEIN
Mol. Mass.:25628.94
Organism:Cricetulus griseus
Description:ChEMBL_108265
Residue:234
BDBM50000971
NameBDBM50000971
Synonyms:CHEMBL3229794
TypeSmall organic molecule
Emp. Form.C14H21N3O6
Mol. Mass.327.333
SMILES[H][C@@]1(O[C@H](C[C@@H]1O)n1cc(C)c(=O)[nH]c1=O)C(O)CNC(=O)CC