Reaction Details
TargetEstrogen receptor
LigandBDBM50001002
Substrate/Competitorn/a
Meas. Tech.ChEMBL_1337645 (CHEMBL3242833)
IC50 118±n/a nM
Citation Kajita, DNakamura, MMatsumoto, YMakishima, MHashimoto, Y Design and synthesis of silicon-containing steroid sulfatase inhibitors possessing pro-estrogen antagonistic character. Bioorg Med Chem22:2244-52 (2014) 
 
Estrogen receptor
Name:Estrogen receptor
Type:Protein
Mol. Mass.:66230.44
Organism:Homo sapiens (Human)
Description:P03372
Residue:595
BDBM50001002
NameBDBM50001002
Synonyms:3,3-Bis(4-Hydroxyphenyl)Pentane CHEMBL1782331
TypeSmall organic molecule
Emp. Form.C17H20O2
Mol. Mass.256.3395
SMILESCCC(CC)(c1ccc(O)cc1)c1ccc(O)cc1